Target
Fatty acid synthase
Ligand
BDBM50153015
Substrate
Meas. Tech.
ChEMBL_857805 (CHEMBL2169238)
IC50
68000±n/a nM
Citation
 Abramson, HN The lipogenesis pathway as a cancer target. J Med Chem 54:5615-38 (2011)  
Target
Name:
Fatty acid synthase
Synonyms:
FAS FAS_CHICK | Fatty acid synthase (FAS)
Type:
Enzyme
Mol. Mass.:
274770.36
Organism:
Gallus gallus (Chicken)
Description:
P12276
Residue:
2512
  
Inhibitor
Name:
BDBM50153015
Synonyms:
(-)-Epicatechin-3-gallate (-)-epicatechin gallate (-)epicatechingallate (2R,3R)-2-(3,4-dihydroxyphenyl)-5,7-dihydroxychroman-3-yl 3,4,5-trihydroxybenzoate 3,4,5-Trihydroxy-benzoic acid 2-(3,4-dihydroxy-phenyl)-5,7-dihydroxy-chroman-3-yl ester Epicatechin gallate | Epicatechin-3-O-gallate
Type:
Small organic molecule
Emp. Form.:
C22H18O10
Mol. Mass.:
442.3723
SMILES:
Oc1cc(O)c2C[C@@H](OC(=O)c3cc(O)c(O)c(O)c3)[C@H](Oc2c1)c1ccc(O)c(O)c1
: