Target
Solute carrier organic anion transporter family member 1B1
Ligand
BDBM520
Substrate
Meas. Tech.
ChEMBL_860286 (CHEMBL2169432)
Ki
1300±n/a nM
Citation
 Karlgren, MVildhede, ANorinder, UWisniewski, JRKimoto, ELai, YHaglund, UArtursson, P Classification of inhibitors of hepatic organic anion transporting polypeptides (OATPs): influence of protein expression on drug-drug interactions. J Med Chem 55:4740-63 (2012)  
Target
Name:
Solute carrier organic anion transporter family member 1B1
Synonyms:
LST1 OATP2 SLC21A6 SO1B1_HUMAN Solute carrier organic anion transporter family member 1B1 (OATP1B1) | Thromboxane B2
Type:
Protein
Mol. Mass.:
76468.06
Organism:
Homo sapiens (Human)
Description:
Q9Y6L6
Residue:
691
  
Inhibitor
Name:
BDBM520
Synonyms:
1,3-thiazol-5-ylmethyl N-[(2S,3S,5S)-3-hydroxy-5-[(2S)-3-methyl-2-{[methyl({[2-(propan-2-yl)-1,3-thiazol-4-yl]methyl})carbamoyl]amino}butanamido]-1,6-diphenylhexan-2-yl]carbamate CHEMBL163 RTV | Ritonavir
Type:
Small organic molecule
Emp. Form.:
C37H48N6O5S2
Mol. Mass.:
720.944
SMILES:
CC(C)[C@H](NC(=O)N(C)Cc1csc(n1)C(C)C)C(=O)N[C@H](C[C@H](O)[C@H](Cc1ccccc1)NC(=O)OCc1cncs1)Cc1ccccc1
: