Target
Alpha-1A adrenergic receptor
Ligand
BDBM50396184
Substrate
Meas. Tech.
ChEMBL_863152 (CHEMBL2175763)
IC50
13±n/a nM
Citation
 Cui, LLi, JXie, X Rediocide A, an Insecticide, induces G-protein-coupled receptor desensitization via activation of conventional protein kinase C. J Nat Prod 75:1058-62 (2012)  
Target
Name:
Alpha-1A adrenergic receptor
Synonyms:
ADA1A_HUMAN ADRA1C Alpha 1A-adrenoceptor Alpha adrenergic receptor 1a Alpha-adrenergic receptor 1c adrenergic Alpha1 | adrenergic Alpha1C
Type:
Cell-surface receptors
Mol. Mass.:
51511.67
Organism:
Homo sapiens (Human)
Description:
P35348
Residue:
466
  
Inhibitor
Name:
BDBM50396184
Synonyms:
REDIOCIDE A
Type:
Small organic molecule
Emp. Form.:
C44H58O13
Mol. Mass.:
794.9235
SMILES:
CC(C)CC(=O)O[C@H]1\C=C\C=C\C(=O)O[C@H]2[C@@H](C)C[C@@H]3[C@]2(O)[C@H](O)[C@@]2(CO)O[C@H]2[C@H]2[C@H]4OC5(O[C@@H]([C@@H](C)[C@]32O5)[C@@]4(O)[C@](C)(O)C[C@H]2CC[C@H]1[C@H]2C)c1ccccc1
: