Target
Tyrosyl-DNA phosphodiesterase 1
Ligand
BDBM50388602
Substrate
Meas. Tech.
ChEMBL_864727 (CHEMBL2174994)
IC50
31000±n/a nM
Citation
 Sirivolu, VRVernekar, SKMarchand, CNaumova, AChergui, ARenaud, AStephen, AGChen, FSham, YYPommier, YWang, Z 5-Arylidenethioxothiazolidinones as inhibitors of tyrosyl-DNA phosphodiesterase I. J Med Chem 55:8671-84 (2012)  
Target
Name:
Tyrosyl-DNA phosphodiesterase 1
Synonyms:
TDP1 Tyrosyl-DNA phosphodiesterase 1 | Tyrosyl-DNA phosphodiesterase 1 (TDP1)
Type:
Enzyme
Mol. Mass.:
68430.66
Organism:
Homo sapiens (Human)
Description:
Q9NUW8
Residue:
608
  
Inhibitor
Name:
BDBM50388602
Synonyms:
FURAMIDINE
Type:
Small organic molecule
Emp. Form.:
C18H16N4O
Mol. Mass.:
304.3458
SMILES:
NC(=N)c1ccc(cc1)-c1ccc(o1)-c1ccc(cc1)C(N)=N
: