Target
Bromodomain-containing protein 4
Ligand
BDBM50365264
Substrate
Meas. Tech.
ChEMBL_873079 (CHEMBL2182555)
Kd
24±n/a nM
Citation
 Bamborough, PDiallo, HGoodacre, JDGordon, LLewis, ASeal, JTWilson, DMWoodrow, MDChung, CW Fragment-based discovery of bromodomain inhibitors part 2: optimization of phenylisoxazole sulfonamides. J Med Chem 55:587-96 (2012)  
Target
Name:
Bromodomain-containing protein 4
Synonyms:
BRD4 Bromodomain-containing protein 4 (BRD4) Protein HUNK1
Type:
Protein
Mol. Mass.:
152264.84
Organism:
Homo sapiens (Human)
Description:
O60885
Residue:
1362
  
Inhibitor
Name:
BDBM50365264
Synonyms:
CHEMBL1738926
Type:
Small organic molecule
Emp. Form.:
C25H21N5O2
Mol. Mass.:
423.4665
SMILES:
Cc1nnc2[C@H](NC(=O)OCc3ccccc3)N=C(c3ccccc3)c3ccccc3-n12
: