Target
E3 ubiquitin-protein ligase Mdm2
Ligand
BDBM50397771
Substrate
Meas. Tech.
ChEMBL_874354 (CHEMBL2182652)
Kd
1±n/a nM
Citation
 Rew, YSun, DGonzalez-Lopez De Turiso, FBartberger, MDBeck, HPCanon, JChen, AChow, DDeignan, JFox, BMGustin, DHuang, XJiang, MJiao, XJin, LKayser, FKopecky, DJLi, YLo, MCLong, AMMichelsen, KOliner, JDOsgood, TRagains, MSaiki, AYSchneider, SToteva, MYakowec, PYan, XYe, QYu, DZhao, XZhou, JMedina, JCOlson, SH Structure-based design of novel inhibitors of the MDM2-p53 interaction. J Med Chem 55:4936-54 (2012)  
Target
Name:
E3 ubiquitin-protein ligase Mdm2
Synonyms:
Double minute 2 protein E3 ubiquitin-protein ligase Mdm2 (p53-binding protein Mdm2) Human Double Minute 2 (HDM2) MDM2-MDMX p53-Binding Protein MDM2 | p53-binding protein
Type:
Oncoprotein
Mol. Mass.:
55196.54
Organism:
Homo sapiens (Human)
Description:
Q00987
Residue:
491
  
Inhibitor
Name:
BDBM50397771
Synonyms:
CHEMBL2059300 | US9593129, Example 67
Type:
Small organic molecule
Emp. Form.:
C28H33Cl2NO5
Mol. Mass.:
534.471
SMILES:
CC[C@H](N1[C@@H]([C@H](C[C@](C)(CC(O)=O)C1=O)c1cccc(Cl)c1)c1ccc(Cl)cc1)C(=O)OC(C)(C)C
: