Target
Epidermal growth factor receptor
Ligand
BDBM50399676
Substrate
Meas. Tech.
ChEMBL_876535 (CHEMBL2188084)
IC50
400±n/a nM
Citation
 Yang, JWang, LJLiu, JJZhong, LZheng, RLXu, YJi, PZhang, CHWang, WJLin, XDLi, LLWei, YQYang, SY Structural optimization and structure-activity relationships of N2-(4-(4-Methylpiperazin-1-yl)phenyl)-N8-phenyl-9H-purine-2,8-diamine derivatives, a new class of reversible kinase inhibitors targeting both EGFR-activating and resistance mutations. J Med Chem 55:10685-99 (2012)  
Target
Name:
Epidermal growth factor receptor
Synonyms:
EGF Receptor Substrate EGFR_HUMAN ERBB1 Epidermal Growth Factor Receptor erbB-1 Epidermal growth factor receptor (EGFR) HER1 Proto-oncogene c-ErbB-1 Tyrosine-Protein Kinase ErbB-1
Type:
Receptor Kinase Domain
Mol. Mass.:
134279.59
Organism:
Homo sapiens (Human)
Description:
P00533
Residue:
1210
  
Inhibitor
Name:
BDBM50399676
Synonyms:
CHEMBL2178352 | US9096601, 8-26
Type:
Small organic molecule
Emp. Form.:
C27H32N8
Mol. Mass.:
468.5966
SMILES:
CN1CCN(CC1)c1ccc(Nc2ncc3nc(Nc4ccccc4)n(C4CCCC4)c3n2)cc1
: