Target
Phosphatidylinositol 4,5-bisphosphate 3-kinase catalytic subunit delta isoform
Ligand
BDBM50401256
Substrate
Meas. Tech.
ChEMBL_882540 (CHEMBL2211630)
Ki
1.1±n/a nM
Citation
 Wurz, RPLiu, LYang, KNishimura, NBo, YPettus, LHCaenepeel, SFreeman, DJMcCarter, JDMullady, ELMiguel, TSWang, LZhang, NAndrews, KLWhittington, DAJiang, JSubramanian, RHughes, PENorman, MH Synthesis and structure-activity relationships of dual PI3K/mTOR inhibitors based on a 4-amino-6-methyl-1,3,5-triazine sulfonamide scaffold. Bioorg Med Chem Lett 22:5714-20 (2012)  
Target
Name:
Phosphatidylinositol 4,5-bisphosphate 3-kinase catalytic subunit delta isoform
Synonyms:
PI3-kinase p110 subunit delta PI3-kinase subunit p110-delta PIK3CD Phosphatidylinositol 4,5-biphosphate 3-kinase catalytic subunit delta (PIK3CD) Phosphatidylinositol 4,5-bisphosphate 3-kinase 110 kDa catalytic subunit delta (PI3K delta) Phosphatidylinositol 4,5-bisphosphate 3-kinase catalytic subunit delta (PI3Kdelta) Phosphatidylinositol 4,5-bisphosphate 3-kinase catalytic subunit delta isoform (PI3K delta) Phosphatidylinositol 4,5-bisphosphate 3-kinase catalytic subunit delta isoform (PI3K-delta) Phosphatidylinositol 4,5-bisphosphate 3-kinase catalytic subunit delta isoform (PI3Kdelta)
Type:
Enzyme Subunit
Mol. Mass.:
119489.41
Organism:
Homo sapiens (Human)
Description:
O00329
Residue:
1044
  
Inhibitor
Name:
BDBM50401256
Synonyms:
CHEMBL2206904 | US8772480, 331
Type:
Small organic molecule
Emp. Form.:
C17H20ClN9O3S
Mol. Mass.:
465.917
SMILES:
COc1cnc(Nc2cnc(Cl)c(NS(=O)(=O)N(C)C)c2)c(c1)-c1nc(C)nc(N)n1
: