Target
C-C chemokine receptor type 8
Ligand
BDBM50401340
Substrate
Meas. Tech.
ChEMBL_884037 (CHEMBL2215086)
EC50
>1000000±n/a nM
Citation
 Thiele, SMalmgaard-Clausen, MEngel-Andreasen, JSteen, ARummel, PCNielsen, MCGloriam, DEFrimurer, TMUlven, TRosenkilde, MM Modulation in selectivity and allosteric properties of small-molecule ligands for CC-chemokine receptors. J Med Chem 55:8164-77 (2012)  
Target
Name:
C-C chemokine receptor type 8
Synonyms:
CCR8 CKRL1 CMKBRL2
Type:
PROTEIN
Mol. Mass.:
40855.53
Organism:
Homo sapiens (Human)
Description:
ChEMBL_454278
Residue:
355
  
Inhibitor
Name:
BDBM50401340
Synonyms:
CHEMBL1976682
Type:
Small organic molecule
Emp. Form.:
C14H10Br2N2
Mol. Mass.:
366.051
SMILES:
BrCc1ccc2ccc3ccc(CBr)nc3c2n1
: