Target
C-C chemokine receptor type 8
Ligand
BDBM50401343
Substrate
Meas. Tech.
ChEMBL_884037 (CHEMBL2215086)
EC50
15000±n/a nM
Citation
 Thiele, SMalmgaard-Clausen, MEngel-Andreasen, JSteen, ARummel, PCNielsen, MCGloriam, DEFrimurer, TMUlven, TRosenkilde, MM Modulation in selectivity and allosteric properties of small-molecule ligands for CC-chemokine receptors. J Med Chem 55:8164-77 (2012)  
Target
Name:
C-C chemokine receptor type 8
Synonyms:
CCR8 CKRL1 CMKBRL2
Type:
PROTEIN
Mol. Mass.:
40855.53
Organism:
Homo sapiens (Human)
Description:
ChEMBL_454278
Residue:
355
  
Inhibitor
Name:
BDBM50401343
Synonyms:
CHEMBL2205801
Type:
Small organic molecule
Emp. Form.:
C14H8N2O2
Mol. Mass.:
236.2255
SMILES:
O=Cc1ccnc2c1ccc1c(C=O)ccnc21
: