Target
C-C chemokine receptor type 8
Ligand
BDBM50401347
Substrate
Meas. Tech.
ChEMBL_884037 (CHEMBL2215086)
EC50
480±n/a nM
Citation
 Thiele, SMalmgaard-Clausen, MEngel-Andreasen, JSteen, ARummel, PCNielsen, MCGloriam, DEFrimurer, TMUlven, TRosenkilde, MM Modulation in selectivity and allosteric properties of small-molecule ligands for CC-chemokine receptors. J Med Chem 55:8164-77 (2012)  
Target
Name:
C-C chemokine receptor type 8
Synonyms:
CCR8 CKRL1 CMKBRL2
Type:
PROTEIN
Mol. Mass.:
40855.53
Organism:
Homo sapiens (Human)
Description:
ChEMBL_454278
Residue:
355
  
Inhibitor
Name:
BDBM50401347
Synonyms:
CHEMBL99384
Type:
Small organic molecule
Emp. Form.:
C16H16N2
Mol. Mass.:
236.3116
SMILES:
Cc1cnc2c(ccc3c(C)c(C)cnc23)c1C
: