Target
C-C chemokine receptor type 8
Ligand
BDBM50401351
Substrate
Meas. Tech.
ChEMBL_884037 (CHEMBL2215086)
EC50
7943.28±n/a nM
Citation
 Thiele, SMalmgaard-Clausen, MEngel-Andreasen, JSteen, ARummel, PCNielsen, MCGloriam, DEFrimurer, TMUlven, TRosenkilde, MM Modulation in selectivity and allosteric properties of small-molecule ligands for CC-chemokine receptors. J Med Chem 55:8164-77 (2012)  
Target
Name:
C-C chemokine receptor type 8
Synonyms:
CCR8 CKRL1 CMKBRL2
Type:
PROTEIN
Mol. Mass.:
40855.53
Organism:
Homo sapiens (Human)
Description:
ChEMBL_454278
Residue:
355
  
Inhibitor
Name:
BDBM50401351
Synonyms:
CHEMBL2205807
Type:
Small organic molecule
Emp. Form.:
C12H12N2
Mol. Mass.:
184.2371
SMILES:
Cc1ccc(nc1)-c1ccc(C)cn1
: