Target
DNA-dependent protein kinase catalytic subunit
Ligand
BDBM50401464
Substrate
Meas. Tech.
ChEMBL_883385 (CHEMBL2214584)
IC50
4200±n/a nM
Citation
 Ihmaid, SKAl-Rawi, JMBradley, CJAngove, MJRobertson, MN Synthesis, DNA-PK inhibition, anti-platelet activity studies of 2-(N-substituted-3-aminopyridine)-substituted-1,3-benzoxazines and DNA-PK and PI3K inhibition, homology modelling studies of 2-morpholino-(7,8-di and 8-substituted)-1,3-benzoxazines. Eur J Med Chem 57:85-101 (2012)  
Target
Name:
DNA-dependent protein kinase catalytic subunit
Synonyms:
DNA-PK catalytic subunit DNA-dependent protein kinase (DNA-PK) DNA-dependent protein kinase catalytic subunit (DNA-PK) HYRC PRKDC | PRKDC_HUMAN
Type:
Protein
Mol. Mass.:
469114.78
Organism:
Homo sapiens (Human)
Description:
P78527
Residue:
4128
  
Inhibitor
Name:
BDBM50401464
Synonyms:
CHEMBL1276747
Type:
Small organic molecule
Emp. Form.:
C18H17N3O4
Mol. Mass.:
339.3453
SMILES:
O=c1nc(oc2cc(OCc3ccncc3)ccc12)N1CCOCC1
: