Target
Baculoviral IAP repeat-containing protein 2
Ligand
BDBM50401483
Substrate
Meas. Tech.
ChEMBL_884122 (CHEMBL2216052)
IC50
1.4±n/a nM
Citation
 Lecis, DMastrangelo, EBelvisi, LBolognesi, MCivera, MCossu, FDe Cesare, MDelia, DDrago, CManenti, GManzoni, LMilani, MMoroni, EPerego, PPotenza, DRizzo, VScavullo, CScolastico, CServida, FVasile, FSeneci, P Dimeric Smac mimetics/IAP inhibitors as in vivo-active pro-apoptotic agents. Part II: Structural and biological characterization. Bioorg Med Chem 20:6709-23 (2012)  
Target
Name:
Baculoviral IAP repeat-containing protein 2
Synonyms:
API1 BIRC2_HUMAN Cellular inhibitor of apoptosis 1 MIHB | RNF48
Type:
Protein
Mol. Mass.:
69900.47
Organism:
Homo sapiens (Human)
Description:
Q13490
Residue:
618
  
Inhibitor
Name:
BDBM50401483
Synonyms:
CHEMBL2204574
Type:
Small organic molecule
Emp. Form.:
C70H88N10O8
Mol. Mass.:
1197.5099
SMILES:
CC[C@H](NC)C(=O)N[C@H]1[C@@H](CNC(=O)CCCC#CC#CCCCC(=O)NC[C@H]2CC[C@H]3CC[C@H](N3C(=O)[C@H]2NC(=O)[C@H](CC)NC)C(=O)NC(c2ccccc2)c2ccccc2)CC[C@H]2CC[C@H](N2C1=O)C(=O)NC(c1ccccc1)c1ccccc1
: