Target
C-C chemokine receptor type 4
Ligand
BDBM50401548
Substrate
Meas. Tech.
ChEMBL_882640 (CHEMBL2213077)
Ki
398.11±n/a nM
Citation
 Smethurst, CABevan, NBrooks, CEmmons, AGough, PJMookherjee, CMoores, KPeace, SPhilp, JPiercy, VWatson, SPZippoli, M In vivo activity of an azole series of CCR2 antagonists. Bioorg Med Chem Lett 22:7252-5 (2012)  
Target
Name:
C-C chemokine receptor type 4
Synonyms:
C-C CKR-4 C-C chemokine receptor type 4 (CCR4) CCR-4 CCR4_HUMAN CMKBR4 | K5-5
Type:
Enzyme
Mol. Mass.:
41406.41
Organism:
Homo sapiens (Human)
Description:
P51679
Residue:
360
  
Inhibitor
Name:
BDBM50401548
Synonyms:
CHEMBL2207094
Type:
Small organic molecule
Emp. Form.:
C13H9Cl3N4O2S2
Mol. Mass.:
423.725
SMILES:
Clc1cc(sc1Cl)S(=O)(=O)Nc1cc(Cl)ccc1Cn1ccnn1
: