Target
5-hydroxytryptamine receptor 3A/3B
Ligand
BDBM50449568
Substrate
Meas. Tech.
ChEMBL_3117 (CHEMBL617960)
Kd
3.2±n/a nM
Citation
 Blum, EBuchheit, KBuescher, HGamse, RKloeppner, EMeigel, HPapageorgiou, CWaelchli, RRevesz, L Design and synthesis of novel ligands for the 5-HT3 and the 5-HT4 receptor Bioorg Med Chem Lett 2:461-466 (1992)    Article 
Target
Name:
5-hydroxytryptamine receptor 3A/3B
Synonyms:
Serotonin 3 receptor (5HT3)
Type:
Mol. Mass.:
Description:
ASSAY_ID of ChEMBL is 357762
Components:
This complex has 2 components.
Component 1
Name:
5-hydroxytryptamine receptor 3A
Synonyms:
5-HT-3 5-HT3A 5-HT3R 5-hydroxytryptamine receptor 3A 5ht3 Htr3a Serotonin 3a (5-HT3a) receptor Serotonin-gated ion channel receptor
Type:
Mol. Mass.:
56056.00
Organism:
Mus musculus (house mouse)
Description:
5HT3A
Residue:
487
  
Component 2
Name:
5-hydroxytryptamine receptor 3B
Synonyms:
5HT3B_MOUSE Serotonin 3 receptor (5HT3) | Serotonin 3b (5-HT3b) receptor
Type:
PROTEIN
Mol. Mass.:
50317.35
Organism:
Mus musculus
Description:
ChEMBL_3121
Residue:
437
  
Inhibitor
Name:
BDBM50449568
Synonyms:
CHEMBL2448558
Type:
Small organic molecule
Emp. Form.:
C16H22ClN3O2
Mol. Mass.:
323.818
SMILES:
[H][C@]12CCCN(CC[C@@H]1NC(=O)c1cc(Cl)c(N)cc1OC)C2
: