Target
3-oxo-5-alpha-steroid 4-dehydrogenase 1
Ligand
BDBM50368782
Substrate
Meas. Tech.
ChEMBL_205190 (CHEMBL812006)
Ki
4±n/a nM
Citation
 Abell, ADErhard, KFYen, HYamashita, DSBrandt, MMohammed, HLevy, MAHolt, DA Preparative chiral HPLC separation of all possible stereoisomers of LY191704 and LY266111 and their in vitro inhibition of human types 1 and 2 steroid 5-reductases Bioorg Med Chem Lett 4:1365-1368 (1994)    Article 
Target
Name:
3-oxo-5-alpha-steroid 4-dehydrogenase 1
Synonyms:
3-oxo-5-alpha-steroid 4-dehydrogenase 1 S5A1_HUMAN SR type 1 Steroid 5-alpha-reductase | Steroid 5-alpha-reductase 1
Type:
Enzyme
Mol. Mass.:
29472.80
Organism:
Homo sapiens (Human)
Description:
P18405
Residue:
259
  
Inhibitor
Name:
BDBM50368782
Synonyms:
Bexlosteride LY-191704
Type:
Small organic molecule
Emp. Form.:
C14H16ClNO
Mol. Mass.:
249.736
SMILES:
CN1[C@@H]2CCc3cc(Cl)ccc3[C@H]2CCC1=O
: