Target
Beta-1 adrenergic receptor
Ligand
BDBM50404791
Substrate
Meas. Tech.
ChEMBL_76827 (CHEMBL690655)
Kd
0.000001±n/a nM
Citation
 Erhardt, PWWoo, CMAnderson, WGGorczynski, RJ Ultra-short-acting beta-adrenergic receptor blocking agents. 2. (Aryloxy)propanolamines containing esters on the aryl function. J Med Chem 25:1408-12 (1983)  
Target
Name:
Beta-1 adrenergic receptor
Synonyms:
ADRB1 adrenergic Beta1
Type:
Enzyme Catalytic Domain
Mol. Mass.:
50540.48
Organism:
GUINEA PIG
Description:
adrenergic Beta1 ADRB1 GUINEA PIG::B0FL73
Residue:
467
  
Inhibitor
Name:
BDBM50404791
Synonyms:
CHEMBL31025
Type:
Small organic molecule
Emp. Form.:
C17H27NO4
Mol. Mass.:
309.4006
SMILES:
COC(=O)CCc1ccc(OCC(O)CNC(C)(C)C)cc1
: