Target
Angiotensin-converting enzyme
Ligand
BDBM50348866
Substrate
Meas. Tech.
ChEBML_36150
IC50
416869±n/a nM
Citation
 Waller, CLMarshall, GR Three-dimensional quantitative structure-activity relationship of angiotesin-converting enzyme and thermolysin inhibitors. II. A comparison of CoMFA models incorporating molecular orbital fields and desolvation free energies based on active-analog and complementary-receptor-field alignment rules. J Med Chem 36:2390-403 (1993)  
Target
Name:
Angiotensin-converting enzyme
Synonyms:
ACE Angiotensin converting enzyme (ACE) Angiotensin-converting enzyme, soluble form CD_antigen=CD143 DCP1 Kininase II
Type:
Enzyme
Mol. Mass.:
149709.01
Organism:
Homo sapiens (Human)
Description:
Residue:
1306
  
Inhibitor
Name:
BDBM50348866
Synonyms:
CHEMBL439762
Type:
Small organic molecule
Emp. Form.:
C10H18N2O3
Mol. Mass.:
214.2615
SMILES:
CC(C)[C@H](N)C(=O)N1CCC[C@H]1C(O)=O
: