Target
Translocator protein
Ligand
BDBM85031
Substrate
Meas. Tech.
ChEMBL_38119 (CHEMBL650074)
IC50
55500000±n/a nM
Citation
 So, SSKarplus, M Genetic neural networks for quantitative structure-activity relationships: improvements and application of benzodiazepine affinity for benzodiazepine/GABAA receptors. J Med Chem 39:5246-56 (1997)  
Target
Name:
Translocator protein
Synonyms:
BZRP Mitochondrial benzodiazepine receptor PKBS Peripheral-type benzodiazepine receptor TSPO_HUMAN
Type:
Enzyme
Mol. Mass.:
18834.74
Organism:
Homo sapiens (Human)
Description:
P30536
Residue:
169
  
Inhibitor
Name:
BDBM85031
Synonyms:
CAS_604-75-1 Oxazepam
Type:
Small organic molecule
Emp. Form.:
C15H11ClN2O2
Mol. Mass.:
286.713
SMILES:
OC1N=C(c2ccccc2)c2cc(Cl)ccc2NC1=O
: