Target
Serine protease 1
Ligand
BDBM50408785
Substrate
Meas. Tech.
ChEMBL_213234 (CHEMBL821444)
Ki
666000000±n/a nM
Citation
 Amat, LCarbó-Dorca, RPonec, R Simple linear QSAR models based on quantum similarity measures. J Med Chem 42:5169-80 (2000)  
Target
Name:
Serine protease 1
Synonyms:
Alpha-trypsin chain 1 Beta-trypsin PRSS1 TRP1 TRY1_HUMAN Thrombin & trypsin Trypsin I | Trypsin-1
Type:
Enzyme
Mol. Mass.:
26557.80
Organism:
Homo sapiens (Human)
Description:
P07477
Residue:
247
  
Inhibitor
Name:
BDBM50408785
Synonyms:
CHEMBL273483
Type:
Small organic molecule
Emp. Form.:
C8H11N
Mol. Mass.:
121.1796
SMILES:
Cc1ccc(CN)cc1
: