Target
Serine protease 1
Ligand
BDBM50408788
Substrate
Meas. Tech.
ChEMBL_213233 (CHEMBL858270)
Ki
29991625.19±n/a nM
Citation
 Amat, LCarbó-Dorca, RPonec, R Simple linear QSAR models based on quantum similarity measures. J Med Chem 42:5169-80 (2000)  
Target
Name:
Serine protease 1
Synonyms:
Alpha-trypsin chain 1 Beta-trypsin PRSS1 TRP1 TRY1_HUMAN Thrombin & trypsin Trypsin I | Trypsin-1
Type:
Enzyme
Mol. Mass.:
26557.80
Organism:
Homo sapiens (Human)
Description:
P07477
Residue:
247
  
Inhibitor
Name:
BDBM50408788
Synonyms:
CHEMBL147170
Type:
Small organic molecule
Emp. Form.:
C15H14ClNO2
Mol. Mass.:
275.73
SMILES:
NCc1ccc(cc1)C(=O)OCc1ccc(Cl)cc1
: