Target
5-hydroxytryptamine receptor 1A
Ligand
BDBM50410440
Substrate
Meas. Tech.
ChEMBL_321087 (CHEMBL883690)
Ki
0.631±n/a nM
Citation
 Heightman, TDGaster, LMPardoe, SLPilleux, JPHadley, MSMiddlemiss, DNPrice, GWRoberts, CScott, CMWatson, JMGordon, LJHolland, VAPowles, JRiley, GJStean, TOTrail, BKUpton, NAustin, NEAyrton, ADColeman, TCutler, L 8-Piperazinyl-2,3-dihydropyrrolo[3,2-g]isoquinolines: potent, selective, orally bioavailable 5-HT1 receptor ligands. Bioorg Med Chem Lett 15:4370-4 (2005)  
Target
Name:
5-hydroxytryptamine receptor 1A
Synonyms:
5-HT-1A 5-hydroxytryptamine receptor 1A (5-HT-1A) ADRB2RL1 Dopamine D2 receptor and serotonin 1a receptor HTR1A | Serotonin receptor 1A
Type:
Mol. Mass.:
46122.49
Organism:
Homo sapiens (Human)
Description:
Residue:
422
  
Inhibitor
Name:
BDBM50410440
Synonyms:
CHEMBL198975
Type:
Small organic molecule
Emp. Form.:
C27H28N6O
Mol. Mass.:
452.5508
SMILES:
CN1CCN(CC1)c1nccc2cc3CCN(C(=O)c4cnn(c4C)-c4ccccc4)c3cc12
: