Target
Adenosine receptor A2b
Ligand
BDBM50086170
Substrate
Meas. Tech.
ChEMBL_330270 (CHEMBL862098)
Ki
2±n/a nM
Citation
 Carotti, ACadavid, MICenteno, NBEsteve, CLoza, MIMartinez, ANieto, RRaviña, ESanz, FSegarra, VSotelo, EStefanachi, AVidal, B Design, synthesis, and structure-activity relationships of 1-,3-,8-, and 9-substituted-9-deazaxanthines at the human A2B adenosine receptor. J Med Chem 49:282-99 (2006)  
Target
Name:
Adenosine receptor A2b
Synonyms:
AA2BR_HUMAN ADORA2B Adenosine receptors A2b | Adenosine receptors; A2a & A2b
Type:
G Protein-Coupled Receptor (GPCR)
Mol. Mass.:
36341.22
Organism:
Homo sapiens (Human)
Description:
Residue:
332
  
Inhibitor
Name:
BDBM50086170
Synonyms:
(4-Cyano-phenyl)-carbamic acid 4-(2,6-dioxo-1,3-dipropyl-2,3,6,7-tetrahydro-1H-purin-8-yl)-phenyl ester CHEMBL273807 N-(4-Cyano-phenyl)-2-[4-(2,6-dioxo-1,3-dipropyl-2,3,6,7-tetrahydro-1H-purin-8-yl)-phenoxy]-acetamide(MRS-1754) | N-(4-cyanophenyl)-2-(4-(2,6-dioxo-1,3-dipropyl-2,3,6,7-tetrahydro-1H-purin-8-yl)phenoxy)acetamide
Type:
Small organic molecule
Emp. Form.:
C26H26N6O4
Mol. Mass.:
486.5224
SMILES:
CCCn1c2nc([nH]c2c(=O)n(CCC)c1=O)-c1ccc(OCC(=O)Nc2ccc(cc2)C#N)cc1
: