Target
Neuropeptide S receptor
Ligand
BDBM50412705
Substrate
Meas. Tech.
ChEMBL_559838 (CHEMBL1021519)
EC50
13.8±n/a nM
Citation
 Guerrini, RCamarda, VTrapella, CCalò, GRizzi, ARuzza, CFiorini, SMarzola, EReinscheid, RKRegoli, DSalvadori, S Synthesis and biological activity of human neuropeptide S analogues modified in position 5: identification of potent and pure neuropeptide S receptor antagonists. J Med Chem 52:524-9 (2009)  
Target
Name:
Neuropeptide S receptor
Synonyms:
Gpr154 Npsr1 | Pgr14
Type:
PROTEIN
Mol. Mass.:
42447.53
Organism:
Mus musculus
Description:
ChEMBL_445691
Residue:
371
  
Inhibitor
Name:
BDBM50412705
Synonyms:
CHEMBL526355
Type:
Small organic molecule
Emp. Form.:
C94H157N31O28S2
Mol. Mass.:
2233.573
SMILES:
CSCC[C@H](NC(=O)CNC(=O)[C@@H](NC(=O)CNC(=O)[C@@H](NC(=O)[C@H](CS)NC(=O)[C@H](CC(N)=O)NC(=O)[C@H](CCCNC(N)=N)NC(=O)[C@H](Cc1ccccc1)NC(=O)[C@@H](N)CO)C(C)C)[C@@H](C)O)C(=O)N[C@@H](CCCCN)C(=O)N[C@@H](CCCCN)C(=O)N[C@@H]([C@@H](C)O)C(=O)N[C@@H](CO)C(=O)N[C@@H](Cc1ccccc1)C(=O)N[C@@H](CCC(N)=O)C(=O)N[C@@H](CCCNC(N)=N)C(=O)N[C@@H](C)C(=O)N[C@@H](CCCCN)C(=O)N[C@@H](CO)C(O)=O
: