Target
5-hydroxytryptamine receptor 1D
Ligand
BDBM50413068
Substrate
Meas. Tech.
ChEMBL_492740 (CHEMBL938540)
Ki
0.316±n/a nM
Citation
 Bromidge, SMBertani, BBorriello, MFaedo, SGordon, LJGranci, EHill, MMarshall, HRStasi, LPZucchelli, VMerlo, GVesentini, AWatson, JMZonzini, L 6-[2-(4-Aryl-1-piperazinyl)ethyl]-2H-1,4-benzoxazin-3(4H)-ones: dual-acting 5-HT1 receptor antagonists and serotonin reuptake inhibitors. Bioorg Med Chem Lett 18:5653-6 (2008)  
Target
Name:
5-hydroxytryptamine receptor 1D
Synonyms:
5-HT-1D 5-HT1D 5HT1D_HUMAN HTR1DA Serotonin (5-HT) receptor | Serotonin Receptor 1D
Type:
G Protein-Coupled Receptor (GPCR)
Mol. Mass.:
41920.63
Organism:
Homo sapiens (Human)
Description:
Receptor binding assays were performed using human clone stably expressed in CHO cells.
Residue:
377
  
Inhibitor
Name:
BDBM50413068
Synonyms:
CHEMBL497979
Type:
Small organic molecule
Emp. Form.:
C24H25FN4O2
Mol. Mass.:
420.4793
SMILES:
Cc1ccc2c(ccc(F)c2n1)N1CCN(CCc2ccc3OCC(=O)Nc3c2)CC1
: