Target
Cholecystokinin receptor type A
Ligand
BDBM50413477
Substrate
Meas. Tech.
ChEMBL_567123 (CHEMBL1030802)
Ki
173.78±n/a nM
Citation
 Akgün, EKörner, MGao, FHarikumar, KGWaser, BReubi, JCPortoghese, PSMiller, LJ Synthesis and in vitro characterization of radioiodinatable benzodiazepines selective for type 1 and type 2 cholecystokinin receptors. J Med Chem 52:2138-47 (2009)  
Target
Name:
Cholecystokinin receptor type A
Synonyms:
CCK-A receptor CCK1-R CCKAR_HUMAN Cholecystokinin receptor Cholecystokinin-1 Receptor
Type:
G Protein-Coupled Receptor (GPCR)
Mol. Mass.:
47859.34
Organism:
Homo sapiens (Human)
Description:
Stable expression of human CCK-1 receptors in HEK 293 cells.
Residue:
428
  
Inhibitor
Name:
BDBM50413477
Synonyms:
CHEMBL475226
Type:
Small organic molecule
Emp. Form.:
C23H19IN4O2
Mol. Mass.:
510.327
SMILES:
CN1c2ccccc2C(=N[C@H](NC(=O)Nc2cccc(I)c2)C1=O)c1ccccc1
: