Target
Cytochrome P450 2A5
Ligand
BDBM50159270
Substrate
Meas. Tech.
ChEMBL_572014 (CHEMBL1023676)
IC50
7295±n/a nM
Citation
 Roy, KRoy, PP Exploring QSAR and QAAR for inhibitors of cytochrome P450 2A6 and 2A5 enzymes using GFA and G/PLS techniques. Eur J Med Chem 44:1941-51 (2009)  
Target
Name:
Cytochrome P450 2A5
Synonyms:
CP2A5_MOUSE Cyp2a5
Type:
PROTEIN
Mol. Mass.:
56752.73
Organism:
Mus musculus
Description:
ChEMBL_572014
Residue:
494
  
Inhibitor
Name:
BDBM50159270
Synonyms:
2-Fluoro-naphthalene CHEMBL191864
Type:
Small organic molecule
Emp. Form.:
C10H7F
Mol. Mass.:
146.161
SMILES:
Fc1ccc2ccccc2c1
: