Target
Serine/threonine-protein kinase Chk1
Ligand
BDBM91857
Substrate
Meas. Tech.
ChEMBL_570759 (CHEMBL1026934)
Ki
0.501187±n/a nM
Citation
 Brown, SPMuchmore, SW Large-scale application of high-throughput molecular mechanics with Poisson-Boltzmann surface area for routine physics-based scoring of protein-ligand complexes. J Med Chem 52:3159-65 (2009)  
Target
Name:
Serine/threonine-protein kinase Chk1
Synonyms:
CHEK1 CHK1 checkpoint homolog Checkpoint kinase-1 (CHK1)
Type:
Enzyme Catalytic Domain
Mol. Mass.:
54443.02
Organism:
Homo sapiens (Human)
Description:
gi_166295192
Residue:
476
  
Inhibitor
Name:
BDBM91857
Synonyms:
Chk1_133
Type:
Emp. Form.:
C30H32N3O3
Mol. Mass.:
482.5928
SMILES:
COc1cc2Cc3c(n[nH]c3-c2cc1OCC[NH+]1CCCCC1)-c1ccc(cc1)-c1ccc(O)cc1
: