Target
Tyrosine-protein phosphatase non-receptor type 1
Ligand
BDBM13953
Substrate
Meas. Tech.
ChEMBL_570758 (CHEMBL1026933)
Ki
631±n/a nM
Citation
 Brown, SPMuchmore, SW Large-scale application of high-throughput molecular mechanics with Poisson-Boltzmann surface area for routine physics-based scoring of protein-ligand complexes. J Med Chem 52:3159-65 (2009)  
Target
Name:
Tyrosine-protein phosphatase non-receptor type 1
Synonyms:
PTN1_HUMAN PTPN1 Protein tyrosine phosphatase-1B (PTP1B) Protein-tyrosine phosphatase 1B (PTP1B) Tyrosine-protein phosphatase non-receptor type 1 (PTP1B)
Type:
Protein phosphatase
Mol. Mass.:
49963.76
Organism:
Homo sapiens (Human)
Description:
Human recombinant GST-fusion PTP1B (1-435).
Residue:
435
  
Inhibitor
Name:
BDBM13953
Synonyms:
1:1 racemic mixture 2-{[4-(2-Acetylamino-2-pentylcarbamoylethyl)naphthalen-1-yl]oxalylamino}benzoic Acid N-Acetyl-4-[(carboxycarbonyl)(2-carboxyphenyl)amino]-N-pentyl-1-naphthylalaninamide linked-fragment derived compound 12
Type:
Small organic molecule
Emp. Form.:
C29H31N3O7
Mol. Mass.:
533.5723
SMILES:
CCCCCNC(=O)C(Cc1ccc(N(C(=O)C(O)=O)c2ccccc2C(O)=O)c2ccccc12)NC(C)=O
: