Target
C-C chemokine receptor type 8
Ligand
BDBM50414972
Substrate
Meas. Tech.
ChEMBL_594037 (CHEMBL1045844)
IC50
128.82±n/a nM
Citation
 Shamovsky, Ide Graaf, CAlderin, LBengtsson, MBladh, HBörjesson, LConnolly, SDyke, HJvan den Heuvel, MJohansson, HJosefsson, BGKristoffersson, ALinnanen, TLisius, AMännikkö, RNordén, BPrice, SRipa, LRognan, DRosendahl, ASkrinjar, MUrbahns, K Increasing selectivity of CC chemokine receptor 8 antagonists by engineering nondesolvation related interactions with the intended and off-target binding sites. J Med Chem 52:7706-23 (2009)  
Target
Name:
C-C chemokine receptor type 8
Synonyms:
CCR8 CKRL1 CMKBRL2
Type:
PROTEIN
Mol. Mass.:
40855.53
Organism:
Homo sapiens (Human)
Description:
ChEMBL_454278
Residue:
355
  
Inhibitor
Name:
BDBM50414972
Synonyms:
CHEMBL568296
Type:
Small organic molecule
Emp. Form.:
C25H31N3O2
Mol. Mass.:
405.5325
SMILES:
CC1Cc2cccc(CN3CCC4(CC3)CCN(CC4)C(=O)c3ccncc3)c2O1
: