Target
Histamine H2 receptor
Ligand
BDBM50415637
Substrate
Meas. Tech.
ChEMBL_621959 (CHEMBL1104101)
EC50
1995.26±n/a nM
Citation
 Igel, PGeyer, RStrasser, ADove, SSeifert, RBuschauer, A Synthesis and structure-activity relationships of cyanoguanidine-type and structurally related histamine H4 receptor agonists. J Med Chem 52:6297-313 (2009)  
Target
Name:
Histamine H2 receptor
Synonyms:
Gastric receptor I HISTAMINE H2 HRH2_HUMAN Histamine H2-Gs alpha S
Type:
G Protein-Coupled Receptor (GPCR)
Mol. Mass.:
40115.31
Organism:
Homo sapiens (Human)
Description:
Residue:
359
  
Inhibitor
Name:
BDBM50415637
Synonyms:
CHEMBL1078358 | UR-PI97
Type:
Small organic molecule
Emp. Form.:
C16H22N6O
Mol. Mass.:
314.3855
SMILES:
NC(=O)NC(NCCCc1ccccc1)=NCCc1cnc[nH]1
: