Target
Histamine H3 receptor
Ligand
BDBM50415643
Substrate
Meas. Tech.
ChEMBL_621970 (CHEMBL1104112)
Ki
524.81±n/a nM
Citation
 Igel, PGeyer, RStrasser, ADove, SSeifert, RBuschauer, A Synthesis and structure-activity relationships of cyanoguanidine-type and structurally related histamine H4 receptor agonists. J Med Chem 52:6297-313 (2009)  
Target
Name:
Histamine H3 receptor
Synonyms:
G-protein coupled receptor 97 HH3R HRH3 Histamine H3 receptor (H3) Histamine receptor (H3 and H4)
Type:
G Protein-Coupled Receptor (GPCR)
Mol. Mass.:
48691.47
Organism:
Homo sapiens (Human)
Description:
Binding assays were using CHO cells stably expressing hH3R receptors.
Residue:
445
  
Inhibitor
Name:
BDBM50415643
Synonyms:
CHEMBL1078642 | UR-PI376
Type:
Small organic molecule
Emp. Form.:
C17H22N6S
Mol. Mass.:
342.462
SMILES:
N#CNC(NCCSc1ccccc1)=NCCCCc1cnc[nH]1
: