Target
Histamine H2 receptor
Ligand
BDBM50415652
Substrate
Meas. Tech.
ChEMBL_621959 (CHEMBL1104101)
EC50
3890.45±n/a nM
Citation
 Igel, PGeyer, RStrasser, ADove, SSeifert, RBuschauer, A Synthesis and structure-activity relationships of cyanoguanidine-type and structurally related histamine H4 receptor agonists. J Med Chem 52:6297-313 (2009)  
Target
Name:
Histamine H2 receptor
Synonyms:
Gastric receptor I HISTAMINE H2 HRH2_HUMAN Histamine H2-Gs alpha S
Type:
G Protein-Coupled Receptor (GPCR)
Mol. Mass.:
40115.31
Organism:
Homo sapiens (Human)
Description:
Residue:
359
  
Inhibitor
Name:
BDBM50415652
Synonyms:
CHEMBL1080772
Type:
Small organic molecule
Emp. Form.:
C16H26N6
Mol. Mass.:
302.4178
SMILES:
N#CNC(NCCCC1CCCCC1)=NCCc1cnc[nH]1
: