Target
Histamine H2 receptor
Ligand
BDBM50415653
Substrate
Meas. Tech.
ChEMBL_621959 (CHEMBL1104101)
EC50
14125.38±n/a nM
Citation
 Igel, PGeyer, RStrasser, ADove, SSeifert, RBuschauer, A Synthesis and structure-activity relationships of cyanoguanidine-type and structurally related histamine H4 receptor agonists. J Med Chem 52:6297-313 (2009)  
Target
Name:
Histamine H2 receptor
Synonyms:
Gastric receptor I HISTAMINE H2 HRH2_HUMAN Histamine H2-Gs alpha S
Type:
G Protein-Coupled Receptor (GPCR)
Mol. Mass.:
40115.31
Organism:
Homo sapiens (Human)
Description:
Residue:
359
  
Inhibitor
Name:
BDBM50415653
Synonyms:
CHEMBL1078210
Type:
Small organic molecule
Emp. Form.:
C17H22N6
Mol. Mass.:
310.3968
SMILES:
N#CNC(NCCCc1ccccc1)=NCCCc1cnc[nH]1
: