Target
Histamine H2 receptor
Ligand
BDBM50415655
Substrate
Meas. Tech.
ChEMBL_621959 (CHEMBL1104101)
EC50
7244.36±n/a nM
Citation
 Igel, PGeyer, RStrasser, ADove, SSeifert, RBuschauer, A Synthesis and structure-activity relationships of cyanoguanidine-type and structurally related histamine H4 receptor agonists. J Med Chem 52:6297-313 (2009)  
Target
Name:
Histamine H2 receptor
Synonyms:
Gastric receptor I HISTAMINE H2 HRH2_HUMAN Histamine H2-Gs alpha S
Type:
G Protein-Coupled Receptor (GPCR)
Mol. Mass.:
40115.31
Organism:
Homo sapiens (Human)
Description:
Residue:
359
  
Inhibitor
Name:
BDBM50415655
Synonyms:
CHEMBL1078529
Type:
Small organic molecule
Emp. Form.:
C16H20N6S
Mol. Mass.:
328.435
SMILES:
N#CNC(NCCSc1ccccc1)=NCCCc1cnc[nH]1
: