Target
Histamine H4 receptor
Ligand
BDBM50415659
Substrate
Meas. Tech.
ChEMBL_621961 (CHEMBL1104103)
EC50
331.13±n/a nM
Citation
 Igel, PGeyer, RStrasser, ADove, SSeifert, RBuschauer, A Synthesis and structure-activity relationships of cyanoguanidine-type and structurally related histamine H4 receptor agonists. J Med Chem 52:6297-313 (2009)  
Target
Name:
Histamine H4 receptor
Synonyms:
AXOR35 GPCR105 HH4R HRH4 Histamine H4 receptor Histamine receptor (H3 and H4) SP9144
Type:
G Protein-Coupled Receptor (GPCR)
Mol. Mass.:
44517.02
Organism:
Homo sapiens (Human)
Description:
Binding assays were using CHO cells stably expressing hH4R receptors.
Residue:
390
  
Inhibitor
Name:
BDBM50415659
Synonyms:
CHEMBL1077636
Type:
Small organic molecule
Emp. Form.:
C12H20N6
Mol. Mass.:
248.3274
SMILES:
CC(C)NC(NC#N)=NCCCCc1cnc[nH]1
: