Target
C-C chemokine receptor type 4
Ligand
BDBM50416304
Substrate
Meas. Tech.
ChEMBL_640125 (CHEMBL1174525)
Ki
398.11±n/a nM
Citation
 Peace, SPhilp, JBrooks, CPiercy, VMoores, KSmethurst, CWatson, SGaines, SZippoli, MMookherjee, CIfe, R Identification of a sulfonamide series of CCR2 antagonists. Bioorg Med Chem Lett 20:3961-4 (2010)  
Target
Name:
C-C chemokine receptor type 4
Synonyms:
C-C CKR-4 C-C chemokine receptor type 4 (CCR4) CCR-4 CCR4_HUMAN CMKBR4 | K5-5
Type:
Enzyme
Mol. Mass.:
41406.41
Organism:
Homo sapiens (Human)
Description:
P51679
Residue:
360
  
Inhibitor
Name:
BDBM50416304
Synonyms:
CHEMBL1171786
Type:
Small organic molecule
Emp. Form.:
C19H12Cl3NO5S
Mol. Mass.:
472.726
SMILES:
OC(=O)c1ccccc1Oc1ccc(Cl)cc1NS(=O)(=O)c1ccc(Cl)c(Cl)c1
: