Target
Cannabinoid receptor 1
Ligand
BDBM50416467
Substrate
Meas. Tech.
ChEMBL_644193 (CHEMBL1212092)
EC50
3981.07±n/a nM
Citation
 Kiyoi, TYork, MFrancis, SEdwards, DWalker, GHoughton, AKCottney, JEBaker, JAdam, JM Design, synthesis, and structure-activity relationship study of conformationally constrained analogs of indole-3-carboxamides as novel CB1 cannabinoid receptor agonists. Bioorg Med Chem Lett 20:4918-21 (2010)  
Target
Name:
Cannabinoid receptor 1
Synonyms:
CANN6 CB-R CNR CNR1_HUMAN Cannabinoid receptor Cannabinoid receptor 1 (brain)
Type:
G Protein-Coupled Receptor (GPCR)
Mol. Mass.:
52868.96
Organism:
Homo sapiens (Human)
Description:
P21554
Residue:
472
  
Inhibitor
Name:
BDBM50416467
Synonyms:
CHEMBL1209643
Type:
Small organic molecule
Emp. Form.:
C21H27N3O2
Mol. Mass.:
353.458
SMILES:
O=C(N1CCNCC1)c1cn2[C@@H](COc3cccc1c23)C1CCCCC1
: