Target
Cannabinoid receptor 1
Ligand
BDBM50416471
Substrate
Meas. Tech.
ChEMBL_644193 (CHEMBL1212092)
EC50
10±n/a nM
Citation
 Kiyoi, TYork, MFrancis, SEdwards, DWalker, GHoughton, AKCottney, JEBaker, JAdam, JM Design, synthesis, and structure-activity relationship study of conformationally constrained analogs of indole-3-carboxamides as novel CB1 cannabinoid receptor agonists. Bioorg Med Chem Lett 20:4918-21 (2010)  
Target
Name:
Cannabinoid receptor 1
Synonyms:
CANN6 CB-R CNR CNR1_HUMAN Cannabinoid receptor Cannabinoid receptor 1 (brain)
Type:
G Protein-Coupled Receptor (GPCR)
Mol. Mass.:
52868.96
Organism:
Homo sapiens (Human)
Description:
P21554
Residue:
472
  
Inhibitor
Name:
BDBM50416471
Synonyms:
CHEMBL1209647
Type:
Small organic molecule
Emp. Form.:
C25H37N3O2
Mol. Mass.:
411.5802
SMILES:
CCN1[C@@H](C)CN(C[C@H]1C)C(=O)c1cn(CC2CCCCC2)c2c(OC)cccc12
: