Target
Adenosine receptor A3
Ligand
BDBM50085371
Substrate
Meas. Tech.
ChEMBL_701308 (CHEMBL1648928)
Ki
478.63±n/a nM
Citation
 Pran Kishore, DBalakumar, CRaghuram Rao, ARoy, PPRoy, K QSAR of adenosine receptor antagonists: Exploring physicochemical requirements for binding of pyrazolo[4,3-e]-1,2,4-triazolo[1,5-c]pyrimidine derivatives with human adenosine A(3) receptor subtype. Bioorg Med Chem Lett 21:818-23 (2011)  
Target
Name:
Adenosine receptor A3
Synonyms:
A3 adenosine receptor (hA3) ADORA3 | Adenosine A3 receptor (A3AR)
Type:
G Protein-Coupled Receptor (GPCR)
Mol. Mass.:
36197.32
Organism:
Homo sapiens (Human)
Description:
P0DMS8
Residue:
318
  
Inhibitor
Name:
BDBM50085371
Synonyms:
1-(8-Allyl-2-furan-2-yl-8H-pyrazolo[4,3-e][1,2,4]triazolo[1,5-c]pyrimidin-5-yl)-3-(4-methoxy-phenyl)-urea | CHEMBL304726
Type:
Small organic molecule
Emp. Form.:
C21H18N8O3
Mol. Mass.:
430.4194
SMILES:
COc1ccc(NC(=O)Nc2nc3nn(CC=C)cc3c3nc(nn23)-c2ccco2)cc1
: