Target
Cytochrome P450 3A4
Ligand
BDBM50338982
Substrate
Meas. Tech.
ChEMBL_738393 (CHEMBL1743470)
Ki
6460±n/a nM
Citation
 Fontana, EDansette, PMPoli, SM Cytochrome p450 enzymes mechanism based inhibitors: common sub-structures and reactivity. Curr Drug Metab 6:413-54 (2005)  
Target
Name:
Cytochrome P450 3A4
Synonyms:
Albendazole monooxygenase CP3A4_HUMAN CYP3A4 CYPIIIA4 Cytochrome P450 3A4 (CYP3A4) Nifedipine oxidase Taurochenodeoxycholate 6-alpha-hydroxylase
Type:
Enzyme
Mol. Mass.:
57349.57
Organism:
Homo sapiens (Human)
Description:
Residue:
503
  
Inhibitor
Name:
BDBM50338982
Synonyms:
(R)-5-((3,4-dimethoxyphenethyl)(methyl)amino)-2-(3,4-dimethoxyphenyl)-2-isopropylpentanenitrile (S)-2-(3,4-Dimethoxy-phenyl)-5-{[2-(3,4-dimethoxy-phenyl)-ethyl]-methyl-amino}-2-isopropyl-pentanenitrile; hydrochloride (Verapamil) 2-(3,4-Dimethoxy-phenyl)-5-{[2-(3,4-dimethoxy-phenyl)-ethyl]-methyl-amino}-2-isopropyl-pentanenitrile 2-(3,4-dimethoxy-phenyl)-5-{[2-(3,4-dimethoxy-phenyl)-ethyl]-methyl-amino}-2-isopropyl-pentanenitrile 5-((3,4-dimethoxyphenethyl)(methyl)amino)-2-(3,4-dimethoxyphenyl)-2-isopropylpentanenitrile 5-{[2-(3,4-Dimethoxy-phenyl)-ethyl]-methyl-amino}-2-isopropyl-2-(4-methoxy-phenyl)-pentanenitrile Calan Covera-HS Iproveratril Isoptin SR VERAPAMIL Verapramil verapamil-R
Type:
Small organic molecule
Emp. Form.:
C27H38N2O4
Mol. Mass.:
454.6016
SMILES:
COc1ccc(CCN(C)CCC[C@@](C#N)(C(C)C)c2ccc(OC)c(OC)c2)cc1OC
: