Target
Beta-2 adrenergic receptor
Ligand
BDBM25771
Substrate
Meas. Tech.
ChEMBL_759384 (CHEMBL1810622)
EC50
0.794328±n/a nM
Citation
 Connolly, SAlcaraz, LBailey, ACadogan, EChristie, JCook, ARFisher, AJHill, SHumphries, AIngall, AHKane, ZPaine, SPairaudeau, GStocks, MJYoung, A Design-driven LO: the discovery of new ultra long acting dibasicß2-adrenoceptor agonists. Bioorg Med Chem Lett 21:4612-6 (2011)  
Target
Name:
Beta-2 adrenergic receptor
Synonyms:
ADRB2 ADRB2_HUMAN Beta-2 adrenoceptor | Beta-2 adrenoreceptor
Type:
Mol. Mass.:
46461.69
Organism:
Homo sapiens (Human)
Description:
P07550
Residue:
413
  
Inhibitor
Name:
BDBM25771
Synonyms:
1-hydroxy-2-naphthoic acid;4-[1-hydroxy-2-[6-(4-phenylbutoxy)hexylamino]ethyl]-2-methylol-phenol Aeromax Serevent | salmeterol xinafoate
Type:
Small organic molecule
Emp. Form.:
C25H37NO4
Mol. Mass.:
415.5656
SMILES:
OCc1cc(ccc1O)C(O)CNCCCCCCOCCCCc1ccccc1
: