Target
Solute carrier organic anion transporter family member 1A4
Ligand
BDBM18860
Substrate
Meas. Tech.
ChEMBL_837488 (CHEMBL2075976)
IC50
50400±n/a nM
Citation
 Takeuchi, AMasuda, SSaito, HAbe, TInui, K Multispecific substrate recognition of kidney-specific organic anion transporters OAT-K1 and OAT-K2. J Pharmacol Exp Ther 299:261-7 (2001) Target
Name:
Solute carrier organic anion transporter family member 1A4
Synonyms:
Brain digoxin carrier protein OATP-B1 Oatp2 Slc21a5 Sodium-independent organic anion-transporting polypeptide 2 | Solute carrier family 21 member 5
Type:
PROTEIN
Mol. Mass.:
73261.82
Organism:
Rattus norvegicus
Description:
ChEMBL_836631
Residue:
661
  
Inhibitor
Name:
BDBM18860
Synonyms:
(2R)-2-amino-3-[4-(4-hydroxy-3-iodophenoxy)-3,5-diiodophenyl]propanoic acid 3,5,3'-triiodo-L-thyronine (T3) Triiodothyronine US10544075, Compound T3 liothyronine | triothyrone
Type:
Hormone
Emp. Form.:
C15H12I3NO4
Mol. Mass.:
650.9735
SMILES:
N[C@@H](Cc1cc(I)c(Oc2ccc(O)c(I)c2)c(I)c1)C(O)=O
: