Target
Multidrug resistance-associated protein 1
Ligand
BDBM22984
Substrate
Meas. Tech.
ChEMBL_836150 (CHEMBL2077586)
IC50
50000±n/a nM
Citation
 Loe, DWAlmquist, KCCole, SPDeeley, RG ATP-dependent 17 beta-estradiol 17-(beta-D-glucuronide) transport by multidrug resistance protein (MRP). Inhibition by cholestatic steroids. J Biol Chem 271:9683-9 (1996)  
Target
Name:
Multidrug resistance-associated protein 1
Synonyms:
7.6.2.2 ABCC1 ATP-binding cassette, sub-family C, member 1 isoform 1 LTC4 transporter MRP MRP1_HUMAN
Type:
Mol. Mass.:
171597.72
Organism:
Homo sapiens (Human)
Description:
P33527
Residue:
1531
  
Inhibitor
Name:
BDBM22984
Synonyms:
(8S,10S)-10-{[(2R,4S,5S,6S)-4-amino-5-hydroxy-6-methyloxan-2-yl]oxy}-6,8,11-trihydroxy-8-(2-hydroxyacetyl)-1-methoxy-5,7,8,9,10,12-hexahydrotetracene-5,12-dione Adriblastina Doxil | Doxorubicin
Type:
Antibiotic
Emp. Form.:
C27H29NO11
Mol. Mass.:
543.5193
SMILES:
COc1cccc2C(=O)c3c(O)c4C[C@](O)(C[C@H](O[C@H]5C[C@H](N)[C@H](O)[C@H](C)O5)c4c(O)c3C(=O)c12)C(=O)CO
: