Target
Activated CDC42 kinase 1
Ligand
BDBM50421253
Substrate
Meas. Tech.
ChEMBL_840099 (CHEMBL2090703)
Ki
20±n/a nM
Citation
 Jiao, XKopecky, DJLiu, JLiu, JJaen, JCCardozo, MGSharma, RWalker, NWesche, HLi, SFarrelly, EXiao, SHWang, ZKayser, F Synthesis and optimization of substituted furo[2,3-d]-pyrimidin-4-amines and 7H-pyrrolo[2,3-d]pyrimidin-4-amines as ACK1 inhibitors. Bioorg Med Chem Lett 22:6212-7 (2012)  
Target
Name:
Activated CDC42 kinase 1
Synonyms:
ACK1 Activated CDC42 kinase 1 (ACK-1) Tyrosine kinase non-receptor protein 2
Type:
Protein
Mol. Mass.:
114577.86
Organism:
Homo sapiens (Human)
Description:
Q07912
Residue:
1038
  
Inhibitor
Name:
BDBM50421253
Synonyms:
CHEMBL2087871
Type:
Small organic molecule
Emp. Form.:
C30H35N5O2
Mol. Mass.:
497.6312
SMILES:
Cc1ccccc1-c1c([nH]c2ncnc(NC[C@@H]3CCCO3)c12)-c1ccc(OCCN2CCCC2)cc1
: