Target
Alpha-1A adrenergic receptor
Ligand
BDBM50422380
Substrate
Meas. Tech.
ChEMBL_216968 (CHEMBL822786)
IC50
46±n/a nM
Citation
 Bolognesi, MLMarucci, GAngeli, PBuccioni, MMinarini, ARosini, MTumiatti, VMelchiorre, C Analogues of prazosin that bear a benextramine-related polyamine backbone exhibit different antagonism toward alpha1-adrenoreceptor subtypes. J Med Chem 44:362-71 (2001)  
Target
Name:
Alpha-1A adrenergic receptor
Synonyms:
ADA1A_RAT Adra1c Alpha-1A adrenoceptor Alpha-1C adrenergic receptor | adrenergic Alpha1A
Type:
Protein
Mol. Mass.:
51620.15
Organism:
Rattus norvegicus (Rat)
Description:
P43140
Residue:
466
  
Inhibitor
Name:
BDBM50422380
Synonyms:
CHEMBL1203232
Type:
Small organic molecule
Emp. Form.:
C68H104N14O6S2
Mol. Mass.:
1277.774
SMILES:
COc1cc2nc(nc(N)c2cc1OC)N(C)CCCCCCN(C)C(=O)c1cccc(CNCCCCCCNCCSSCCNCCCCCCNCc2cccc(c2)C(=O)N(C)CCCCCCN(C)c2nc(N)c3cc(OC)c(OC)cc3n2)c1
: