Target
Acetylcholinesterase
Ligand
BDBM10597
Substrate
Meas. Tech.
ChEMBL_307248 (CHEMBL829154)
IC50
0.32±n/a nM
Citation
 Martín-Santamaría, SMuñoz-Muriedas, JLuque, FJGago, F Modulation of binding strength in several classes of active site inhibitors of acetylcholinesterase studied by comparative binding energy analysis. J Med Chem 47:4471-82 (2004)  
Target
Name:
Acetylcholinesterase
Synonyms:
ACES_HUMAN Acetylcholinesterase (AChE) | Acetylcholinesterase (human AChE)
Type:
Enzyme
Mol. Mass.:
67792.70
Organism:
Homo sapiens (Human)
Description:
P22303
Residue:
614
  
Inhibitor
Name:
BDBM10597
Synonyms:
(1S)-7-chloro-15-ethyl-10-azatetracyclo[11.3.1.0^{2,11}.0^{4,9}]heptadeca-2(11),3,5,7,9,14-hexaen-3-amine CHEMBL143812 rac-huprine H7
Type:
Small organic molecule
Emp. Form.:
C18H19ClN2
Mol. Mass.:
298.81
SMILES:
CCC1=CC2CC(C1)c1c(C2)nc2cc(Cl)ccc2c1N
: