Target
72 kDa type IV collagenase
Ligand
BDBM11364
Substrate
Meas. Tech.
ChEMBL_458931 (CHEMBL924950)
Ki
12±n/a nM
Citation
 Verma, RPHansch, C Matrix metalloproteinases (MMPs): chemical-biological functions and (Q)SARs. Bioorg Med Chem 15:2223-68 (2007)  
Target
Name:
72 kDa type IV collagenase
Synonyms:
72 kDa gelatinase CLG4A Gelatinase A (MMP-2) MMP2_HUMAN Matrix metalloproteinase-2 (MMP 2) Matrix metalloproteinases 2 (MMP-2) | TBE-1
Type:
Enzyme
Mol. Mass.:
73870.36
Organism:
Homo sapiens (Human)
Description:
P08253
Residue:
660
  
Inhibitor
Name:
BDBM11364
Synonyms:
2-{[(2-chlorophenyl)methyl](4-methoxybenzene)sulfonamido}-N-hydroxypropanamide hydroxamate deriv. B24
Type:
Small organic molecule
Emp. Form.:
C17H19ClN2O5S
Mol. Mass.:
398.861
SMILES:
COc1ccc(cc1)S(=O)(=O)N(Cc1ccccc1Cl)C(C)C(=O)NO
: