Target
Sex hormone-binding globulin
Ligand
BDBM50060957
Substrate
Meas. Tech.
ChEMBL_466706 (CHEMBL922711)
Kd
0.832000±n/a nM
Citation
 Cherkasov, ABan, FSantos-Filho, OThorsteinson, NFallahi, MHammond, GL An updated steroid benchmark set and its application in the discovery of novel nanomolar ligands of sex hormone-binding globulin. J Med Chem 51:2047-56 (2008)  
Target
Name:
Sex hormone-binding globulin
Synonyms:
SHBG Testis-specific androgen-binding protein
Type:
PROTEIN
Mol. Mass.:
43780.19
Organism:
Homo sapiens (Human)
Description:
ChEMBL_466706
Residue:
402
  
Inhibitor
Name:
BDBM50060957
Synonyms:
2-Hydroxyestradol 2-methyl ether CHEMBL299613 | Panzem
Type:
Small organic molecule
Emp. Form.:
C19H26O3
Mol. Mass.:
302.4079
SMILES:
COc1cc2[C@H]3CC[C@]4(C)[C@@H](O)CC[C@H]4[C@@H]3CCc2cc1O
: